Navigation


Custom Query (33 matches)

Filters
 
Or
 
  
 
Columns

Show under each result:


Results (31 - 33 of 33)

1 2 3 4 5 6 7 8 9 10 11
Ticket Resolution Summary Owner Reporter
#45 invalid Make Error - fifo.c Mwesigwa Isaac Rwankoba
Description

Am getting the following error while making freeDiameter on OpenSuSe?

Please assist to resolve

cd /Diameter/freeDiameter/build/libfdproto && /usr/bin/gcc -Dlibfdproto_EXPORTS -D_GNU_SOURCE -Wall -g -O0 -fPIC -I/Diameter/freeDiameter/include -I/Diameter/freeDiameter/build/include -o CMakeFiles/libfdproto.dir/fifo.c.o -c /Diameter/freeDiameter/libfdproto/fifo.c /Diameter/freeDiameter/libfdproto/fifo.c: In function ‘fd_fifo_move’: /Diameter/freeDiameter/libfdproto/fifo.c:223:3: warning: assignment of read-only location ‘"TODO"’ [enabled by default] /Diameter/freeDiameter/libfdproto/fifo.c:223:3: error: incompatible types when assigning to type ‘char[5]’ from type ‘char *’ make[2]: * [libfdproto/CMakeFiles/libfdproto.dir/fifo.c.o] Error 1 make[2]: Leaving directory `/Diameter/freeDiameter/build' make[1]: * [libfdproto/CMakeFiles/libfdproto.dir/all] Error 2 make[1]: Leaving directory `/Diameter/freeDiameter/build' make: * [all] Error 2

#46 wontfix AttributeError: 'AccountChangeNotification' object has no attribute 'smtp_server' lily62
Description

How to Reproduce

While doing a POST operation on /register, Trac issued an internal error.

(please provide additional details here)

Request parameters:

{'__FORM_TOKEN': u'1207d6194d94d2321612c93b',
 'action': u'create',
 'email': u'',
 'name': u'',
 'password': u'09122256634',
 'password_confirm': u'09122256634',
 'user': u'lily62'}

User agent: Mozilla/5.0 (Windows NT 6.1; rv:22.0) Gecko/20100101 Firefox/22.0

System Information

System information not available

Enabled Plugins

Plugin information not available

Python Traceback

Traceback (most recent call last):
  File "/usr/local/lib/python2.7/dist-packages/Trac-1.0.1dev_r11445-py2.7.egg/trac/web/main.py", line 497, in _dispatch_request
    dispatcher.dispatch(req)
  File "/usr/local/lib/python2.7/dist-packages/Trac-1.0.1dev_r11445-py2.7.egg/trac/web/main.py", line 214, in dispatch
    resp = chosen_handler.process_request(req)
  File "/usr/lib/pymodules/python2.7/acct_mgr/web_ui.py", line 352, in process_request
    _create_user(req, self.env)
  File "/usr/lib/pymodules/python2.7/acct_mgr/web_ui.py", line 71, in _create_user
    mgr.set_password(user, password)
  File "/usr/lib/pymodules/python2.7/acct_mgr/api.py", line 144, in set_password
    self._notify('created', user, password)
  File "/usr/lib/pymodules/python2.7/acct_mgr/api.py", line 253, in _notify
    getattr(l, func)(*args)
  File "/usr/lib/pymodules/python2.7/acct_mgr/notification.py", line 41, in user_created
    notifier.notify(username, 'New user registration')
  File "/usr/lib/pymodules/python2.7/acct_mgr/notification.py", line 90, in notify
    NotifyEmail.notify(self, username, subject)
  File "/usr/local/lib/python2.7/dist-packages/Trac-1.0.1dev_r11445-py2.7.egg/trac/notification.py", line 343, in notify
    Notify.notify(self, resid)
  File "/usr/local/lib/python2.7/dist-packages/Trac-1.0.1dev_r11445-py2.7.egg/trac/notification.py", line 231, in notify
    self.send(torcpts, ccrcpts)
  File "/usr/lib/pymodules/python2.7/acct_mgr/notification.py", line 160, in send
    % (self.smtp_server, self.smtp_port, recipients))
AttributeError: 'AccountChangeNotification' object has no attribute 'smtp_server'
#52 worksforme freediameter-dev compile issue on Ubuntu 12.04 liviu
Description

Hello,

The headers of the current version of the freediameter-dev package fail to compile cleanly.

Version: [liviu ◄ Icecrown]$ sudo apt-cache show freediameter-dev Package: freediameter-dev Source: freediameter Version: 1.2.0+precise1 Architecture: amd64 Maintainer: Sebastien Decugis <sdecugis@freediameter.net> Installed-Size: 226 Depends: freediameter-common (= 1.2.0+precise1), libsctp-dev, libgnutls-dev, libgcrypt-dev Homepage: http://www.freediameter.net Priority: extra Section: universe/devel Filename: pool/universe/f/freediameter/freediameter-dev_1.2.0+precise1_amd64.deb Size: 58260 SHA256: e8e7c4b34e66f8806c35790c01b0ae4d76eda6c5aae1a495e1ea08ff627415d4 SHA1: a8a9636bde9de465c2aed169b6ff9e522e044a44 MD5sum: 6cc68637c9e0e6c808c785370849d517 Description: This package provides the development files for freeDiameter.

Behaviour. By simply including the header files: #include <freeDiameter/freeDiameter-host.h> #include <freeDiameter/libfdcore.h> #include <freeDiameter/libfdproto.h> #include <freeDiameter/extension.h>

I'm getting: In file included from /usr/include/freeDiameter/libfdcore.h:44:0,

from aaa_diameter.c:30:

/usr/include/freeDiameter/libfdproto.h: In function ‘fd_thr_term’: /usr/include/freeDiameter/libfdproto.h:849:15: error: ‘ANNOYING’ undeclared (first use in this function) /usr/include/freeDiameter/libfdproto.h:849:15: note: each undeclared identifier is reported only once for each function it appears in /usr/include/freeDiameter/libfdproto.h:851:15: error: ‘CALL’ undeclared (first use in this function) /usr/include/freeDiameter/libfdproto.h: In function ‘fd_cleanup_mutex’: /usr/include/freeDiameter/libfdproto.h:866:71: error: expected expression before ‘)’ token /usr/include/freeDiameter/libfdproto.h: In function ‘fd_cleanup_rwlock’: /usr/include/freeDiameter/libfdproto.h:871:74: error: expected expression before ‘)’ token /usr/include/freeDiameter/libfdproto.h: In function ‘fd_cleanup_socket’: /usr/include/freeDiameter/libfdproto.h:881:54: error: expected expression before ‘)’ token

I enabled EXCLUDE_DEPRECATED, and fixed the issues with the following patch: https://gist.github.com/liviuchircu/b405fccde22d0360bb0a

If there is any more information you need, please let me know.

1 2 3 4 5 6 7 8 9 10 11
Note: See TracQuery for help on using queries.